Reaction Details
TargetProthrombin
LigandBDBM50133525
Substrate/Competitorn/a
Meas. Tech.ChEBML_208316
Ki 4.6±n/a nM
Citation Sanderson, PEDyer, DLNaylor-Olsen, AMVacca, JPGardell, SJDale Lewis, SLucas, BJLyle, EALynch, JJMulichak, AM L-373,890, An achiral, noncovalent, subnanomolar thrombin inhibitor Bioorg Med Chem Lett7:1497-1500 (1997)    Article
 
Prothrombin
Name:Prothrombin
Type:Protein
Mol. Mass.:70029.57
Organism:Homo sapiens (Human)
Description:P00734
Residue:622
BDBM50133525
NameBDBM50133525
Synonyms:CHEMBL115643 N-(4-Amino-cyclohexylmethyl)-2-(6-methyl-2-oxo-3-phenylmethanesulfonylamino-2H-pyridin-1-yl)-acetamide
TypeSmall organic molecule
Emp. Form.C22H30N4O4S
Mol. Mass.446.563
SMILESCc1ccc(NS(=O)(=O)Cc2ccccc2)c(=O)n1CC(=O)NC[C@H]1CC[C@H](N)CC1