Reaction Details
TargetNeuromedin-B receptor
LigandBDBM50289794
Substrate/Competitorn/a
Meas. Tech.ChEBML_88176
Ki 37±n/a nM
Citation Horwell, DKneen, CPritchard, MRatcliffe, GRoberts, ESuman-Chauhan, NSteiner, KBetche, H Design and synthesis of a targeted set of aromatic amino acid derivatives for identification of new lead compounds Bioorg Med Chem Lett7:1957-1962 (1997)    Article
 
Neuromedin-B receptor
Name:Neuromedin-B receptor
Type:Enzyme Catalytic Domain
Mol. Mass.:43447.11
Organism:Homo sapiens (Human)
Description:Bombesin 1 NMBR 0::P28336
Residue:390
BDBM50289794
NameBDBM50289794
Synonyms:CHEMBL292119 | [2-(1H-Indol-3-yl)-1-isobutylcarbamoyl-ethyl]-carbamic acid 1-trityl-1H-imidazol-4-ylmethyl ester
TypeSmall organic molecule
Emp. Form.C39H39N5O3
Mol. Mass.625.7587
SMILESCC(C)CNC(=O)C(Cc1c[nH]c2ccccc12)NC(=O)OCc1cn(cn1)C(c1ccccc1)(c1ccccc1)c1ccccc1