Reaction Details
TargetProthrombin
LigandBDBM50060000
Substrate/Competitorn/a
Meas. Tech.ChEBML_207962
IC50 26±n/a nM
Citation Salimbeni, APaleari, FCanevotti, RCriscuoli, MCriscuoli, MLippi, AAngiolini, MBelvisi, LScolastico, CColombo, L Design and synthesis of conformationally constrained arginal thrombin inhibitors Bioorg Med Chem Lett7:2205-2210 (1997)    Article
 
Prothrombin
Name:Prothrombin
Type:Protein
Mol. Mass.:70029.57
Organism:Homo sapiens (Human)
Description:P00734
Residue:622
BDBM50060000
NameBDBM50060000
Synonyms:(S)-1-((R)-2-Methylamino-2-phenyl-acetyl)-pyrrolidine-2-carboxylic acid ((S)-1-formyl-4-guanidino-butyl)-amide | CHEMBL105205
TypeSmall organic molecule
Emp. Form.C20H30N6O3
Mol. Mass.402.4906
SMILESCN[C@@H](C(=O)N1CCC[C@H]1C(=O)N[C@@H](CCCNC(N)=N)C=O)c1ccccc1