Reaction Details
TargetRetinoic acid receptor gamma
LigandBDBM50290082
Substrate/Competitorn/a
Meas. Tech.ChEBML_196013
Ki 174±n/a nM
Citation Diaz, PMichel, SStella, LCharpentier, B Synthesis and biological activities of new heterocyclic aromatic retinoids Bioorg Med Chem Lett7:2289-2294 (1997)    Article
 
Retinoic acid receptor gamma
Name:Retinoic acid receptor gamma
Type:PROTEIN
Mol. Mass.:50345.43
Organism:Homo sapiens (Human)
Description:ChEMBL_1458016
Residue:454
BDBM50290082
NameBDBM50290082
Synonyms:3-(3-Adamantan-1-yl-4-methoxy-phenyl)-2H-chromene-7-carboxylic acid | CHEMBL75732
TypeSmall organic molecule
Emp. Form.C27H28O4
Mol. Mass.416.5088
SMILESCOc1ccc(cc1C12C[C@H]3C[C@H](C[C@H](C3)C1)C2)C1=Cc2ccc(cc2OC1)C(O)=O