Reaction Details
TargetRetinoic acid receptor alpha
LigandBDBM50048280
Substrate/Competitorn/a
Meas. Tech.ChEBML_197414
Ki 1100±n/a nM
Citation Diaz, PMichel, SStella, LCharpentier, B Synthesis and biological activities of new heterocyclic aromatic retinoids Bioorg Med Chem Lett7:2289-2294 (1997)    Article
 
Retinoic acid receptor alpha
Name:Retinoic acid receptor alpha
Type:PROTEIN
Mol. Mass.:50778.87
Organism:Homo sapiens (Human)
Description:ChEMBL_1466191
Residue:462
BDBM50048280
NameBDBM50048280
Synonyms:6-(3-(1-Adamantyl)-4-methoxyphenyl)-2-naphthoic acid ADAPALENE | CHEMBL1265
TypeSmall organic molecule
Emp. Form.C28H28O3
Mol. Mass.412.5201
SMILESCOc1ccc(cc1C12CC3CC(CC(C3)C1)C2)-c1ccc2cc(ccc2c1)C(O)=O