Reaction Details
TargetRetinoic acid receptor gamma
LigandBDBM50290083
Substrate/Competitorn/a
Meas. Tech.ChEBML_196013
Ki 531±n/a nM
Citation Diaz, PMichel, SStella, LCharpentier, B Synthesis and biological activities of new heterocyclic aromatic retinoids Bioorg Med Chem Lett7:2289-2294 (1997)    Article
 
Retinoic acid receptor gamma
Name:Retinoic acid receptor gamma
Type:PROTEIN
Mol. Mass.:50345.43
Organism:Homo sapiens (Human)
Description:ChEMBL_1458016
Residue:454
BDBM50290083
NameBDBM50290083
Synonyms:3-(3,5-Di-tert-butyl-4-hydroxy-phenyl)-2H-chromene-7-carboxylic acid | CHEMBL308170
TypeSmall organic molecule
Emp. Form.C24H28O4
Mol. Mass.380.4767
SMILESCC(C)(C)c1cc(cc(c1O)C(C)(C)C)C1=Cc2ccc(cc2OC1)C(O)=O