Reaction Details
TargetD(3) dopamine receptor
LigandBDBM50063279
Substrate/Competitorn/a
Meas. Tech.ChEMBL_58772 (CHEMBL669160)
Ki 2±n/a nM
Citation Belliotti, TRKesten, SRRubin, JRWustrow, DJGeorgic, LMZoski, KTAkunne, HCWise, LD Novel cyclohexyl amides as potent and selective D3 dopamine receptor ligands Bioorg Med Chem Lett7:2403-2408 (1997)    Article
 
D(3) dopamine receptor
Name:D(3) dopamine receptor
Type:n/a
Mol. Mass.:44243.43
Organism:Homo sapiens (Human)
Description:n/a
Residue:400
BDBM50063279
NameBDBM50063279
Synonyms:CHEMBL309623 | Cyclohexanecarboxylic acid {4-[2-(4-phenyl-piperazin-1-yl)-ethyl]-cyclohexyl}-amide
TypeSmall organic molecule
Emp. Form.C25H39N3O
Mol. Mass.397.5967
SMILESO=C(N[C@H]1CC[C@H](CCN2CCN(CC2)c2ccccc2)CC1)C1CCCCC1