Reaction Details
TargetD(3) dopamine receptor
LigandBDBM50290218
Substrate/Competitorn/a
Meas. Tech.ChEBML_58772
Ki 4±n/a nM
Citation Belliotti, TRKesten, SRRubin, JRWustrow, DJGeorgic, LMZoski, KTAkunne, HCWise, LD Novel cyclohexyl amides as potent and selective D3 dopamine receptor ligands Bioorg Med Chem Lett7:2403-2408 (1997)    Article
 
D(3) dopamine receptor
Name:D(3) dopamine receptor
Type:n/a
Mol. Mass.:44243.43
Organism:Homo sapiens (Human)
Description:n/a
Residue:400
BDBM50290218
NameBDBM50290218
Synonyms:CHEMBL78617 | Cyclopentanecarboxylic acid (4-{2-[4-(2,3-dichloro-phenyl)-piperazin-1-yl]-ethyl}-cyclohexyl)-amide
TypeSmall organic molecule
Emp. Form.C24H35Cl2N3O
Mol. Mass.452.46
SMILESClc1cccc(N2CCN(CC[C@H]3CC[C@@H](CC3)NC(=O)C3CCCC3)CC2)c1Cl