Reaction Details
TargetD(2) dopamine receptor
LigandBDBM50054067
Substrate/Competitorn/a
Meas. Tech.ChEBML_58455
Ki 0.500000±n/a nM
Citation Belliotti, TRKesten, SRRubin, JRWustrow, DJGeorgic, LMZoski, KTAkunne, HCWise, LD Novel cyclohexyl amides as potent and selective D3 dopamine receptor ligands Bioorg Med Chem Lett7:2403-2408 (1997)    Article
 
D(2) dopamine receptor
Name:D(2) dopamine receptor
Type:Cell-surface receptors
Mol. Mass.:50647.10
Organism:Homo sapiens (Human)
Description:P14416
Residue:443
BDBM50054067
NameBDBM50054067
Synonyms:(2R)-7-Dipropylamino-5,6,7,8-tetrahydro-naphthalen-2-ol (R)-7-(dipropylamino)-5,6,7,8-tetrahydronaphthalen-2-ol (R)-7-Dipropylamino-5,6,7,8-tetrahydro-naphthalen-2-ol.HCl CHEMBL301559
TypeSmall organic molecule
Emp. Form.C16H25NO
Mol. Mass.247.3758
SMILESCCCN(CCC)[C@@H]1CCc2ccc(O)cc2C1