Reaction Details
TargetDelta-type opioid receptor
LigandBDBM50290387
Substrate/Competitorn/a
Meas. Tech.ChEBML_146485
Ki 0.780000±n/a nM
Citation Schmidhammer, HDaurer, DWieser, MMonory, KBorsodi, AElliott, JTraynor, JR Synthesis and biological evaluation of 14-alkoxymorphinans. 14.1 14-ethoxy-5-methyl substituted indolomorphinans with opioid receptor selectivity Bioorg Med Chem Lett7:151-156 (1997)    Article
 
Delta-type opioid receptor
Name:Delta-type opioid receptor
Type:G Protein-Coupled Receptor (GPCR)
Mol. Mass.:40465.04
Organism:Rattus norvegicus (rat)
Description:Competition binding assays were using CHO-K1 cell membranes expressing the opioid receptor.
Residue:372
BDBM50290387
NameBDBM50290387
Synonyms:22-cyclopropylmethyl-2-ethoxy-13-methyl-14-oxa-11,22-diazaheptacyclo[13.9.1.01,13.02,21.04,12.05,10.019,25]pentacosa-4(12),5(10),6,8,15,17,19(25)-heptaen-16-ol; with Hydrochloric Acid | CHEMBL558004
TypeSmall organic molecule
Emp. Form.C29H32N2O3
Mol. Mass.456.576
SMILESCCO[C@]12Cc3c([nH]c4ccccc34)[C@]3(C)Oc4c5c(CC1N(CC1CC1)CC[C@@]235)ccc4O