Reaction Details
TargetDelta-type opioid receptor
LigandBDBM50450528
Substrate/Competitorn/a
Meas. Tech.ChEBML_53570
Ki 0.460000±n/a nM
Citation Dondio, GRonzoni, SPetrillo, PDesJarlais, RLRaveglia, LF Pyrrolooctahydroisoquinolines as potent and selective opioid receptor ligands: SAR analysis and docking studies Bioorg Med Chem Lett7:2967-2972 (1997)    Article
 
Delta-type opioid receptor
Name:Delta-type opioid receptor
Type:Enzyme Catalytic Domain
Mol. Mass.:40577.25
Organism:MOUSE
Description:P32300
Residue:372
BDBM50450528
NameBDBM50450528
Synonyms:CHEMBL2051964
TypeSmall organic molecule
Emp. Form.C18H27NO3
Mol. Mass.305.4119
SMILESCc1ccc(O)c(c1)C(=O)NC[C@]1(C)C[C@H](O)CC(C)(C)C1