Reaction Details
TargetKappa-type opioid receptor
LigandBDBM50061063
Substrate/Competitorn/a
Meas. Tech.ChEBML_92550
Ki 500±n/a nM
Citation Dondio, GRonzoni, SPetrillo, PDesJarlais, RLRaveglia, LF Pyrrolooctahydroisoquinolines as potent and selective opioid receptor ligands: SAR analysis and docking studies Bioorg Med Chem Lett7:2967-2972 (1997)    Article
 
Kappa-type opioid receptor
Name:Kappa-type opioid receptor
Type:Enzyme
Mol. Mass.:42656.78
Organism:Mus musculus (Mouse)
Description:P33534
Residue:380
BDBM50061063
NameBDBM50061063
Synonyms:(4aR,8aS)-8a-(3-Hydroxy-phenyl)-3,6-dimethyl-4,4a,5,6,7,8,8a,9-octahydro-1H-pyrrolo[2,3-g]isoquinoline-2-carboxylic acid diethylamide | CHEMBL108076
TypeSmall organic molecule
Emp. Form.C24H33N3O2
Mol. Mass.395.5377
SMILESCCN(CC)C(=O)c1[nH]c2C[C@]3(CCN(C)C[C@@H]3Cc2c1C)c1cccc(O)c1