Reaction Details
TargetMu-type opioid receptor
LigandBDBM50061061
Substrate/Competitorn/a
Meas. Tech.ChEMBL_138866 (CHEMBL747712)
Ki 407±n/a nM
Citation Dondio, GRonzoni, SPetrillo, PDesJarlais, RLRaveglia, LF Pyrrolooctahydroisoquinolines as potent and selective opioid receptor ligands: SAR analysis and docking studies Bioorg Med Chem Lett7:2967-2972 (1997)    Article
 
Mu-type opioid receptor
Name:Mu-type opioid receptor
Type:Enzyme Catalytic Domain
Mol. Mass.:44431.62
Organism:MOUSE
Description:OPIATE Mu OPRM1 MOUSE::P42866
Residue:398
BDBM50061061
NameBDBM50061061
Synonyms:(4aR,8aS)-6-Ethyl-8a-(3-hydroxy-phenyl)-3-methyl-4,4a,5,6,7,8,8a,9-octahydro-1H-pyrrolo[2,3-g]isoquinoline-2-carboxylic acid diethylamide | CHEMBL100729
TypeSmall organic molecule
Emp. Form.C25H35N3O2
Mol. Mass.409.5643
SMILESCCN(CC)C(=O)c1[nH]c2C[C@]3(CCN(CC)C[C@@H]3Cc2c1C)c1cccc(O)c1