Reaction Details
TargetHistamine H3 receptor
LigandBDBM22916
Substrate/Competitorn/a
Meas. Tech.ChEBML_86896
Ki 0.300000±n/a nM
Citation Khan, MYates, SLTedford, CEKirschbaum, KPhillips, JG Diastereoselective synthesis of trans-2-(1-triphenylmethyl-1H-imidazol-4-yl)cyclopropanecarboxylic acids: key intermediates for the preparation of potent and chiral histamine H3 receptor agents Bioorg Med Chem Lett7:3017-3022 (1997)    Article
 
Histamine H3 receptor
Name:Histamine H3 receptor
Type:G Protein-Coupled Receptor (GPCR)
Mol. Mass.:48607.98
Organism:Rattus norvegicus (rat)
Description:n/a
Residue:445
BDBM22916
NameBDBM22916
Synonyms:5-{3-[(4-iodophenyl)methoxy]propyl}-1H-imidazole Iodoproxyfan
TypeSmall organic molecule
Emp. Form.C13H15IN2O
Mol. Mass.342.1755
SMILESIc1ccc(COCCCc2cnc[nH]2)cc1