Reaction Details
TargetAdenosine receptor A1
LigandBDBM50290902
Substrate/Competitorn/a
Meas. Tech.ChEMBL_29485 (CHEMBL641719)
Ki 8±n/a nM
Citation Ha, SBMelman, NJacobson, KANair, V New base-altered adenosine analogues: Synthesis and affinity at adenosine A1 and A2A receptors Bioorg Med Chem Lett7:3085-3090 (1997)    Article
 
Adenosine receptor A1
Name:Adenosine receptor A1
Type:Protein
Mol. Mass.:36704.13
Organism:Rattus norvegicus (rat)
Description:n/a
Residue:326
BDBM50290902
NameBDBM50290902
Synonyms:(2R,3S,4R,5R)-2-Hydroxymethyl-5-[6-(pyrrolidin-1-ylamino)-purin-9-yl]-tetrahydro-furan-3,4-diol | CHEMBL104580
TypeSmall organic molecule
Emp. Form.C14H20N6O4
Mol. Mass.336.3464
SMILESOC[C@H]1O[C@H]([C@H](O)[C@@H]1O)n1cnc2c(NN3CCCC3)ncnc12