Reaction Details
TargetAdenosine receptor A1
LigandBDBM50366489
Substrate/Competitorn/a
Meas. Tech.ChEBML_29485
Ki 23±n/a nM
Citation Ha, SBMelman, NJacobson, KANair, V New base-altered adenosine analogues: Synthesis and affinity at adenosine A1 and A2A receptors Bioorg Med Chem Lett7:3085-3090 (1997)    Article
 
Adenosine receptor A1
Name:Adenosine receptor A1
Type:Protein
Mol. Mass.:36704.13
Organism:Rattus norvegicus (rat)
Description:n/a
Residue:326
BDBM50366489
NameBDBM50366489
Synonyms:CHEMBL611882
TypeSmall organic molecule
Emp. Form.C19H22IN5O5
Mol. Mass.527.313
SMILESOC[C@H](Cc1ccccc1)Nc1nc(I)nc2n(cnc12)C1O[C@H](CO)[C@@H](O)[C@H]1O