Reaction Details
TargetNeprilysin
LigandBDBM50291559
Substrate/Competitorn/a
Meas. Tech.ChEBML_144318
IC50 0.600000±n/a nM
Citation De Lombaert, SStamford, LBBlanchard, LTan, JHoyer, DDiefenbacher, CGWei, DWallace, EMMoskal, MASavage, PJeng, AY Potent non-peptidic dual inhibitors of endothelin-converting enzyme and neutral endopeptidase 24.11 Bioorg Med Chem Lett7:1059-1064 (1997)    Article
 
Neprilysin
Name:Neprilysin
Type:Enzyme
Mol. Mass.:85505.38
Organism:Homo sapiens (Human)
Description:P08473
Residue:750
BDBM50291559
NameBDBM50291559
Synonyms:CHEMBL268473 | {2-Benzo[1,3]dioxol-5-yl-1-[(S)-2-biphenyl-4-yl-1-(1H-tetrazol-5-yl)-ethylamino]-ethyl}-phosphonic acid
TypeSmall organic molecule
Emp. Form.C24H24N5O5P
Mol. Mass.493.4516
SMILESOP(O)(=O)C(Cc1ccc2OCOc2c1)N[C@@H](Cc1ccc(cc1)-c1ccccc1)c1nnn[nH]1