Reaction Details
TargetEndothelin-converting enzyme 1
LigandBDBM50291561
Substrate/Competitorn/a
Meas. Tech.ChEBML_64201
IC50 17±n/a nM
Citation De Lombaert, SStamford, LBBlanchard, LTan, JHoyer, DDiefenbacher, CGWei, DWallace, EMMoskal, MASavage, PJeng, AY Potent non-peptidic dual inhibitors of endothelin-converting enzyme and neutral endopeptidase 24.11 Bioorg Med Chem Lett7:1059-1064 (1997)    Article
 
Endothelin-converting enzyme 1
Name:Endothelin-converting enzyme 1
Type:Enzyme
Mol. Mass.:87155.11
Organism:Homo sapiens (Human)
Description:P42892
Residue:770
BDBM50291561
NameBDBM50291561
Synonyms:CHEMBL10251 | {1-[(S)-2-Biphenyl-4-yl-1-(1H-tetrazol-5-yl)-ethylamino]-2-naphthalen-1-yl-ethyl}-phosphonic acid
TypeSmall organic molecule
Emp. Form.C27H26N5O3P
Mol. Mass.499.5008
SMILESOP(O)(=O)C(Cc1cccc2ccccc12)N[C@@H](Cc1ccc(cc1)-c1ccccc1)c1nnn[nH]1