Reaction Details
TargetMuscarinic acetylcholine receptor M2
LigandBDBM50291594
Substrate/Competitorn/a
Meas. Tech.ChEBML_140112
Ki>10000±n/a nM
Citation Hudkins, RLDeHaven-Hudkins, DLDoukas, P Design of dual acting anticonvulsant-antimuscarinic succinimide and hydantoin derivatives Bioorg Med Chem Lett7:979-984 (1997)    Article
 
Muscarinic acetylcholine receptor M2
Name:Muscarinic acetylcholine receptor M2
Type:Enzyme Catalytic Domain
Mol. Mass.:51555.53
Organism:RAT
Description:P10980
Residue:466
BDBM50291594
NameBDBM50291594
Synonyms:1-(4-Diethylamino-but-2-ynyl)-3-phenyl-pyrrolidine-2,5-dione | CHEMBL367436
TypeSmall organic molecule
Emp. Form.C18H22N2O2
Mol. Mass.298.3795
SMILESCCN(CC)CC#CCN1C(=O)CC(C1=O)c1ccccc1