Reaction Details
TargetMuscarinic acetylcholine receptor M1
LigandBDBM50291595
Substrate/Competitorn/a
Meas. Tech.ChEBML_139961
Ki 1620±n/a nM
Citation Hudkins, RLDeHaven-Hudkins, DLDoukas, P Design of dual acting anticonvulsant-antimuscarinic succinimide and hydantoin derivatives Bioorg Med Chem Lett7:979-984 (1997)    Article
 
Muscarinic acetylcholine receptor M1
Name:Muscarinic acetylcholine receptor M1
Type:Enzyme Catalytic Domain
Mol. Mass.:51390.46
Organism:RAT
Description:P08482
Residue:460
BDBM50291595
NameBDBM50291595
Synonyms:1'-(4-diisopropylamino-2-butynyl)spiro[9H-fluorene-9,3'-(tetrahydro-1'H-pyrrole)]-2',5'-dione | CHEMBL178323
TypeSmall organic molecule
Emp. Form.C26H28N2O2
Mol. Mass.400.5127
SMILESCC(C)N(CC#CCN1C(=O)CC2(C1=O)c1ccccc1-c1ccccc21)C(C)C