Reaction Details
TargetMuscarinic acetylcholine receptor M1
LigandBDBM50291594
Substrate/Competitorn/a
Meas. Tech.ChEBML_139961
Ki 2300±n/a nM
Citation Hudkins, RLDeHaven-Hudkins, DLDoukas, P Design of dual acting anticonvulsant-antimuscarinic succinimide and hydantoin derivatives Bioorg Med Chem Lett7:979-984 (1997)    Article
 
Muscarinic acetylcholine receptor M1
Name:Muscarinic acetylcholine receptor M1
Type:Enzyme Catalytic Domain
Mol. Mass.:51390.46
Organism:RAT
Description:P08482
Residue:460
BDBM50291594
NameBDBM50291594
Synonyms:1-(4-Diethylamino-but-2-ynyl)-3-phenyl-pyrrolidine-2,5-dione | CHEMBL367436
TypeSmall organic molecule
Emp. Form.C18H22N2O2
Mol. Mass.298.3795
SMILESCCN(CC)CC#CCN1C(=O)CC(C1=O)c1ccccc1