Reaction Details
TargetD(2) dopamine receptor
LigandBDBM50291681
Substrate/Competitorn/a
Meas. Tech.ChEMBL_58464 (CHEMBL670395)
Ki 9400±n/a nM
Citation Hegde, VRDai, PLadislaw, CPatel, MGPuar, MSPachter, JA D4 dopamine receptor-selective compounds from the Chinese plant Phoebe chekiangensis Bioorg Med Chem Lett7:1207-1212 (1997)    Article
 
D(2) dopamine receptor
Name:D(2) dopamine receptor
Type:Cell-surface receptors
Mol. Mass.:50647.10
Organism:Homo sapiens (Human)
Description:P14416
Residue:443
BDBM50291681
NameBDBM50291681
Synonyms:2,3-Dihydro-1H-indol-5-ol | CHEMBL19331
TypeSmall organic molecule
Emp. Form.C8H9NO
Mol. Mass.135.1632
SMILESOc1ccc2NCCc2c1