Reaction Details
TargetD(2) dopamine receptor
LigandBDBM50242856
Substrate/Competitorn/a
Meas. Tech.ChEBML_58464
Ki 3900±n/a nM
Citation Hegde, VRDai, PLadislaw, CPatel, MGPuar, MSPachter, JA D4 dopamine receptor-selective compounds from the Chinese plant Phoebe chekiangensis Bioorg Med Chem Lett7:1207-1212 (1997)    Article
 
D(2) dopamine receptor
Name:D(2) dopamine receptor
Type:Cell-surface receptors
Mol. Mass.:50647.10
Organism:Homo sapiens (Human)
Description:P14416
Residue:443
BDBM50242856
NameBDBM50242856
Synonyms:(1R)-1-(4-hydroxybenzyl)-1,2,3,4-tetrahydroisoquinoline-6,7-diol CHEMBL501778
TypeSmall organic molecule
Emp. Form.C16H17NO3
Mol. Mass.271.3111
SMILESOc1ccc(C[C@H]2NCCc3cc(O)c(O)cc23)cc1