Reaction Details
TargetD(4) dopamine receptor
LigandBDBM29135
Substrate/Competitorn/a
Meas. Tech.ChEBML_58936
Ki>35000±n/a nM
Citation Hegde, VRDai, PLadislaw, CPatel, MGPuar, MSPachter, JA D4 dopamine receptor-selective compounds from the Chinese plant Phoebe chekiangensis Bioorg Med Chem Lett7:1207-1212 (1997)    Article
 
D(4) dopamine receptor
Name:D(4) dopamine receptor
Type:Enzyme
Mol. Mass.:48373.19
Organism:Homo sapiens (Human)
Description:P21917
Residue:419
BDBM29135
NameBDBM29135
Synonyms:CHEMBL11608 p-Tyramine | tyramine
TypeSmall organic molecule
Emp. Form.C8H11NO
Mol. Mass.137.179
SMILESNCCc1ccc(O)cc1