Reaction Details
TargetD(2) dopamine receptor
LigandBDBM29135
Substrate/Competitorn/a
Meas. Tech.ChEBML_58464
Ki>17000±n/a nM
Citation Hegde, VRDai, PLadislaw, CPatel, MGPuar, MSPachter, JA D4 dopamine receptor-selective compounds from the Chinese plant Phoebe chekiangensis Bioorg Med Chem Lett7:1207-1212 (1997)    Article
 
D(2) dopamine receptor
Name:D(2) dopamine receptor
Type:Cell-surface receptors
Mol. Mass.:50647.10
Organism:Homo sapiens (Human)
Description:P14416
Residue:443
BDBM29135
NameBDBM29135
Synonyms:CHEMBL11608 p-Tyramine | tyramine
TypeSmall organic molecule
Emp. Form.C8H11NO
Mol. Mass.137.179
SMILESNCCc1ccc(O)cc1