Reaction Details
TargetD(4) dopamine receptor
LigandBDBM50366495
Substrate/Competitorn/a
Meas. Tech.ChEBML_58936
Ki 185±n/a nM
Citation Hegde, VRDai, PLadislaw, CPatel, MGPuar, MSPachter, JA D4 dopamine receptor-selective compounds from the Chinese plant Phoebe chekiangensis Bioorg Med Chem Lett7:1207-1212 (1997)    Article
 
D(4) dopamine receptor
Name:D(4) dopamine receptor
Type:Enzyme
Mol. Mass.:48373.19
Organism:Homo sapiens (Human)
Description:P21917
Residue:419
BDBM50366495
NameBDBM50366495
Synonyms:(+)butaclamol | CHEMBL1255588
TypeSmall organic molecule
Emp. Form.C25H31NO
Mol. Mass.361.5197
SMILESCC(C)(C)[C@@]1(O)CCN2C[C@@H]3c4ccccc4CCc4cccc([C@H]2C1)c34