Reaction Details
TargetSubstance-P receptor
LigandBDBM50070554
Substrate/Competitorn/a
Meas. Tech.ChEMBL_142731 (CHEMBL745035)
IC50 1.9±n/a nM
Citation Kubota, HOkamoto, YFujii, MIkeda, KTakeuchi, MShibanuma, TIsomura, Y Synthesis and NK1 receptor antagonistic activity of (+/-)-1-acyl-3-(3,4- dichlorophenyl)-3-[2-(spiro-substituted piperidin-1'-yl)ethyl]piperidines. Bioorg Med Chem Lett8:1541-6 (1999) Substance-P receptor
Name:Substance-P receptor
Type:Enzyme Catalytic Domain
Mol. Mass.:46261.42
Organism:GUINEA PIG
Description:Neurokinin NK1 TACR1 GUINEA PIG::P30547
Residue:407
BDBM50070554
NameBDBM50070554
Synonyms:1'-(2-{3-(3,4-dichlorophenyl)-1-[2-(3-isopropoxyphenyl)acetyl]hexahydro-3-pyridinyl}ethyl)-1'-methylspiro[1,2,3,4-tetrahydroisoquinoline-1,4'-(hexahydropyridine)ium]-3-one iodide | CHEMBL288123
TypeSmall organic molecule
Emp. Form.C38H46Cl2N3O3
Mol. Mass.663.696
SMILESCC(C)Oc1cccc(CC(=O)N2CCCC(CC[N+]3(C)CCC4(CC3)NC(=O)Cc3ccccc43)(C2)c2ccc(Cl)c(Cl)c2)c1