Reaction Details
TargetSubstance-P receptor
LigandBDBM50070546
Substrate/Competitorn/a
Meas. Tech.ChEBML_142731
IC50 0.019000±n/a nM
Citation Kubota, HOkamoto, YFujii, MIkeda, KTakeuchi, MShibanuma, TIsomura, Y Synthesis and NK1 receptor antagonistic activity of (+/-)-1-acyl-3-(3,4- dichlorophenyl)-3-[2-(spiro-substituted piperidin-1'-yl)ethyl]piperidines. Bioorg Med Chem Lett8:1541-6 (1999) Substance-P receptor
Name:Substance-P receptor
Type:Enzyme Catalytic Domain
Mol. Mass.:46261.42
Organism:GUINEA PIG
Description:Neurokinin NK1 TACR1 GUINEA PIG::P30547
Residue:407
BDBM50070546
NameBDBM50070546
Synonyms:1-(2-{(S)-3-(3,4-Dichloro-phenyl)-1-[2-(3-isopropoxy-phenyl)-acetyl]-piperidin-3-yl}-ethyl)-4-phenyl-1-azonia-bicyclo[2.2.2]octane; chloride SR 140333
TypeSmall organic molecule
Emp. Form.C37H45Cl2N2O2
Mol. Mass.620.671
SMILESCC(C)Oc1cccc(CC(=O)N2CCC[C@@](CC[N+]34CCC(CC3)(CC4)c3ccccc3)(C2)c2ccc(Cl)c(Cl)c2)c1