Reaction Details
TargetGenome polyprotein
LigandBDBM50070797
Substrate/Competitorn/a
Meas. Tech.ChEBML_143632
IC50 28000±n/a nM
Citation Llinàs-Brunet, MBailey, MFazal, GGoulet, SHalmos, TLaplante, SMaurice, RPoirier, MPoupart, MAThibeault, DWernic, DLamarre, D Peptide-based inhibitors of the hepatitis C virus serine protease. Bioorg Med Chem Lett8:1713-8 (1999) Genome polyprotein
Name:Genome polyprotein
Type:Protein
Mol. Mass.:67067.41
Organism:Hepatitis C virus
Description:A3EZI9
Residue:631
BDBM50070797
NameBDBM50070797
Synonyms:CHEMBL2370476 | Hexapeptide analogue
TypeSmall organic molecule
Emp. Form.C29H46N6O12S
Mol. Mass.702.774
SMILESCC[C@H](C)[C@H](NC(=O)[C@@H](CC(O)=O)NC(=O)[C@H](CC(O)=O)NC(C)=O)C(=O)N[C@@H](C(C)C)C(=O)N1CCC[C@H]1C(=O)N[C@@H](CS)C(O)=O