Reaction Details
TargetGenome polyprotein
LigandBDBM50366505
Substrate/Competitorn/a
Meas. Tech.ChEBML_143632
IC50 52000±n/a nM
Citation Llinàs-Brunet, MBailey, MFazal, GGoulet, SHalmos, TLaplante, SMaurice, RPoirier, MPoupart, MAThibeault, DWernic, DLamarre, D Peptide-based inhibitors of the hepatitis C virus serine protease. Bioorg Med Chem Lett8:1713-8 (1999) Genome polyprotein
Name:Genome polyprotein
Type:Protein
Mol. Mass.:67067.41
Organism:Hepatitis C virus
Description:A3EZI9
Residue:631
BDBM50366505
NameBDBM50366505
Synonyms:CHEMBL1790289
TypeSmall organic molecule
Emp. Form.C30H50N6O10S
Mol. Mass.686.817
SMILESCC[C@H](C)[C@H](NC(=O)[C@@H](NC(=O)[C@H](CC(O)=O)NC(C)=O)C(C)C)C(=O)N[C@@H](C(C)C)C(=O)N1CCC[C@H]1C(=O)N[C@@H](CS)C(O)=O