Reaction Details
TargetEndothelin receptor type B
LigandBDBM50034263
Substrate/Competitorn/a
Meas. Tech.ChEBML_63877
IC50 340±n/a nM
Citation Mederski, WWDorsch, DOsswald, MAnzali, SChristadler, MSchmitges, CJSchelling, PWilm, CFluck, M Endothelin antagonists: discovery of EMD 122946, a highly potent and orally active ETA selective antagonist. Bioorg Med Chem Lett8:1771-6 (1999) Endothelin receptor type B
Name:Endothelin receptor type B
Type:PROTEIN
Mol. Mass.:49616.89
Organism:Sus scrofa
Description:ChEMBL_63872
Residue:443
BDBM50034263
NameBDBM50034263
Synonyms:CHEMBL25438 Sodium; (Z)-2-benzo[1,3]dioxol-5-yl-4-(4-methoxy-phenyl)-4-oxo-3-(3,4,5-trimethoxy-benzyl)-but-2-enoate
TypeSmall organic molecule
Emp. Form.C28H25O9
Mol. Mass.505.4932
SMILESCOc1ccc(cc1)C(=O)C(\Cc1cc(OC)c(OC)c(OC)c1)=C(/C([O-])=O)c1ccc2OCOc2c1