Reaction Details
TargetMetabotropic glutamate receptor 8
LigandBDBM50071161
Substrate/Competitorn/a
Meas. Tech.ChEBML_104489
IC50>300000±n/a nM
Citation Valli, MJSchoepp, DDWright, RAJohnson, BGKingston, AETomlinson, RMonn, JA Synthesis and metabotropic glutamate receptor antagonist activity of N1-substituted analogs of 2R,4R-4-aminopyrrolidine-2,4-dicarboxylic acid. Bioorg Med Chem Lett8:1985-90 (1999) Metabotropic glutamate receptor 8
Name:Metabotropic glutamate receptor 8
Type:Enzyme Catalytic Domain
Mol. Mass.:101759.58
Organism:Homo sapiens (Human)
Description:metabotropic glutamate 8 GRM8 HUMAN::O00222
Residue:908
BDBM50071161
NameBDBM50071161
Synonyms:(2R,4R)-4-Amino-1-benzyl-pyrrolidine-2,4-dicarboxylic acid CHEMBL60238
TypeSmall organic molecule
Emp. Form.C13H16N2O4
Mol. Mass.264.2771
SMILESN[C@@]1(C[C@@H](N(Cc2ccccc2)C1)C(O)=O)C(O)=O