Reaction Details
TargetPlasmepsin II
LigandBDBM50071546
Substrate/Competitorn/a
Meas. Tech.ChEBML_154921
Ki 5800±n/a nM
Citation Carroll, CDPatel, HJohnson, TOGuo, TOrlowski, MHe, ZMCavallaro, CLGuo, JOksman, AGluzman, IYConnelly, JChelsky, DGoldberg, DEDolle, RE Identification of potent inhibitors of Plasmodium falciparum plasmepsin II from an encoded statine combinatorial library. Bioorg Med Chem Lett8:2315-20 (1999) Plasmepsin II
Name:Plasmepsin II
Type:Enzyme
Mol. Mass.:51482.09
Organism:Plasmodium falciparum
Description:P46925
Residue:453
BDBM50071546
NameBDBM50071546
Synonyms:3-Hydroxy-6-methyl-4-{(S)-2-[2-(naphthalen-2-yloxy)-acetylamino]-2-phenyl-acetylamino}-heptanoic acid butylamide | CHEMBL77681
TypeSmall organic molecule
Emp. Form.C32H41N3O5
Mol. Mass.547.685
SMILESCCCCNC(=O)CC(O)C(CC(C)C)NC(=O)[C@@H](NC(=O)COc1ccc2ccccc2c1)c1ccccc1