Reaction Details
TargetCathepsin D
LigandBDBM50071547
Substrate/Competitorn/a
Meas. Tech.ChEMBL_45324 (CHEMBL661012)
Ki 700±n/a nM
Citation Carroll, CDPatel, HJohnson, TOGuo, TOrlowski, MHe, ZMCavallaro, CLGuo, JOksman, AGluzman, IYConnelly, JChelsky, DGoldberg, DEDolle, RE Identification of potent inhibitors of Plasmodium falciparum plasmepsin II from an encoded statine combinatorial library. Bioorg Med Chem Lett8:2315-20 (1999) Cathepsin D
Name:Cathepsin D
Type:Enzyme
Mol. Mass.:44551.72
Organism:Homo sapiens (Human)
Description:Human proCathepsin D (SwissProt accession number P07339) was expressed in Sf9 cells, purified, and autoactivated.
Residue:412
BDBM50071547
NameBDBM50071547
Synonyms:3-Hydroxy-4-{(R)-2-[2-(naphthalen-2-yloxy)-acetylamino]-2-phenyl-acetylamino}-5-phenyl-pentanoic acid butylamide | CHEMBL75156
TypeSmall organic molecule
Emp. Form.C35H39N3O5
Mol. Mass.581.7013
SMILESCCCCNC(=O)CC(O)C(Cc1ccccc1)NC(=O)[C@H](NC(=O)COc1ccc2ccccc2c1)c1ccccc1