Reaction Details
TargetCathepsin D
LigandBDBM50146770
Substrate/Competitorn/a
Meas. Tech.ChEMBL_45324 (CHEMBL661012)
Ki 1300±n/a nM
Citation Carroll, CDPatel, HJohnson, TOGuo, TOrlowski, MHe, ZMCavallaro, CLGuo, JOksman, AGluzman, IYConnelly, JChelsky, DGoldberg, DEDolle, RE Identification of potent inhibitors of Plasmodium falciparum plasmepsin II from an encoded statine combinatorial library. Bioorg Med Chem Lett8:2315-20 (1999) Cathepsin D
Name:Cathepsin D
Type:Enzyme
Mol. Mass.:44551.72
Organism:Homo sapiens (Human)
Description:Human proCathepsin D (SwissProt accession number P07339) was expressed in Sf9 cells, purified, and autoactivated.
Residue:412
BDBM50146770
NameBDBM50146770
Synonyms:CHEMBL94646 PS-222036
TypeSmall organic molecule
Emp. Form.C32H48N4O4
Mol. Mass.552.7479
SMILESCCC(C)C(NC(=O)c1ccc(CNC)cc1)C(=O)NC(CC(C)C)C(O)CC(=O)NCCCc1ccccc1