Reaction Details
TargetPlasmepsin II
LigandBDBM50071551
Substrate/Competitorn/a
Meas. Tech.ChEBML_154921
Ki 500±n/a nM
Citation Carroll, CDPatel, HJohnson, TOGuo, TOrlowski, MHe, ZMCavallaro, CLGuo, JOksman, AGluzman, IYConnelly, JChelsky, DGoldberg, DEDolle, RE Identification of potent inhibitors of Plasmodium falciparum plasmepsin II from an encoded statine combinatorial library. Bioorg Med Chem Lett8:2315-20 (1999) Plasmepsin II
Name:Plasmepsin II
Type:Enzyme
Mol. Mass.:51482.09
Organism:Plasmodium falciparum
Description:P46925
Residue:453
BDBM50071551
NameBDBM50071551
Synonyms:CHEMBL427946 PS-725074
TypeSmall organic molecule
Emp. Form.C29H41N3O6
Mol. Mass.527.6523
SMILESCCCCNC(=O)CC(O)C(Cc1ccccc1)NC(=O)[C@@H](NC(=O)c1ccc(OC)cc1OC)C(C)C