Reaction Details
TargetCathepsin D
LigandBDBM50071553
Substrate/Competitorn/a
Meas. Tech.ChEMBL_45324 (CHEMBL661012)
Ki 3900±n/a nM
Citation Carroll, CDPatel, HJohnson, TOGuo, TOrlowski, MHe, ZMCavallaro, CLGuo, JOksman, AGluzman, IYConnelly, JChelsky, DGoldberg, DEDolle, RE Identification of potent inhibitors of Plasmodium falciparum plasmepsin II from an encoded statine combinatorial library. Bioorg Med Chem Lett8:2315-20 (1999) Cathepsin D
Name:Cathepsin D
Type:Enzyme
Mol. Mass.:44551.72
Organism:Homo sapiens (Human)
Description:Human proCathepsin D (SwissProt accession number P07339) was expressed in Sf9 cells, purified, and autoactivated.
Residue:412
BDBM50071553
NameBDBM50071553
Synonyms:1-({(1S,2S)-1-[1-Benzyl-2-hydroxy-3-(3-phenyl-propylcarbamoyl)-propylcarbamoyl]-2-methyl-butylcarbamoyl}-methyl)-4-phenyl-piperidine-4-carboxylic acid amide | CHEMBL75554
TypeSmall organic molecule
Emp. Form.C40H53N5O5
Mol. Mass.683.8793
SMILESCC[C@H](C)[C@H](NC(=O)CN1CCC(CC1)(C(N)=O)c1ccccc1)C(=O)NC(Cc1ccccc1)C(O)CC(=O)NCCCc1ccccc1