Reaction Details
TargetPlasmepsin II
LigandBDBM50071547
Substrate/Competitorn/a
Meas. Tech.ChEBML_154921
Ki 15000±n/a nM
Citation Carroll, CDPatel, HJohnson, TOGuo, TOrlowski, MHe, ZMCavallaro, CLGuo, JOksman, AGluzman, IYConnelly, JChelsky, DGoldberg, DEDolle, RE Identification of potent inhibitors of Plasmodium falciparum plasmepsin II from an encoded statine combinatorial library. Bioorg Med Chem Lett8:2315-20 (1999) Plasmepsin II
Name:Plasmepsin II
Type:Enzyme
Mol. Mass.:51482.09
Organism:Plasmodium falciparum
Description:P46925
Residue:453
BDBM50071547
NameBDBM50071547
Synonyms:3-Hydroxy-4-{(R)-2-[2-(naphthalen-2-yloxy)-acetylamino]-2-phenyl-acetylamino}-5-phenyl-pentanoic acid butylamide | CHEMBL75156
TypeSmall organic molecule
Emp. Form.C35H39N3O5
Mol. Mass.581.7013
SMILESCCCCNC(=O)CC(O)C(Cc1ccccc1)NC(=O)[C@H](NC(=O)COc1ccc2ccccc2c1)c1ccccc1