Reaction Details
TargetCathepsin D
LigandBDBM50071559
Substrate/Competitorn/a
Meas. Tech.ChEMBL_45324 (CHEMBL661012)
Ki 200±n/a nM
Citation Carroll, CDPatel, HJohnson, TOGuo, TOrlowski, MHe, ZMCavallaro, CLGuo, JOksman, AGluzman, IYConnelly, JChelsky, DGoldberg, DEDolle, RE Identification of potent inhibitors of Plasmodium falciparum plasmepsin II from an encoded statine combinatorial library. Bioorg Med Chem Lett8:2315-20 (1999) Cathepsin D
Name:Cathepsin D
Type:Enzyme
Mol. Mass.:44551.72
Organism:Homo sapiens (Human)
Description:Human proCathepsin D (SwissProt accession number P07339) was expressed in Sf9 cells, purified, and autoactivated.
Residue:412
BDBM50071559
NameBDBM50071559
Synonyms:(S)-2-[2-(Naphthalen-2-yloxy)-acetylamino]-pentanedioic acid 5-amide 1-[(1-benzyl-3-butylcarbamoyl-2-hydroxy-propyl)-amide] | CHEMBL73919
TypeSmall organic molecule
Emp. Form.C32H40N4O6
Mol. Mass.576.6832
SMILESCCCCNC(=O)CC(O)C(Cc1ccccc1)NC(=O)[C@H](CCC(N)=O)NC(=O)COc1ccc2ccccc2c1