Reaction Details
TargetPlasmepsin II
LigandBDBM50071553
Substrate/Competitorn/a
Meas. Tech.ChEBML_154921
Ki 600±n/a nM
Citation Carroll, CDPatel, HJohnson, TOGuo, TOrlowski, MHe, ZMCavallaro, CLGuo, JOksman, AGluzman, IYConnelly, JChelsky, DGoldberg, DEDolle, RE Identification of potent inhibitors of Plasmodium falciparum plasmepsin II from an encoded statine combinatorial library. Bioorg Med Chem Lett8:2315-20 (1999) Plasmepsin II
Name:Plasmepsin II
Type:Enzyme
Mol. Mass.:51482.09
Organism:Plasmodium falciparum
Description:P46925
Residue:453
BDBM50071553
NameBDBM50071553
Synonyms:1-({(1S,2S)-1-[1-Benzyl-2-hydroxy-3-(3-phenyl-propylcarbamoyl)-propylcarbamoyl]-2-methyl-butylcarbamoyl}-methyl)-4-phenyl-piperidine-4-carboxylic acid amide | CHEMBL75554
TypeSmall organic molecule
Emp. Form.C40H53N5O5
Mol. Mass.683.8793
SMILESCC[C@H](C)[C@H](NC(=O)CN1CCC(CC1)(C(N)=O)c1ccccc1)C(=O)NC(Cc1ccccc1)C(O)CC(=O)NCCCc1ccccc1