Reaction Details
TargetNeuromedin-B receptor
LigandBDBM50071732
Substrate/Competitorn/a
Meas. Tech.ChEBML_39622
Ki 184±n/a nM
Citation Ashwood, VBrownhill, VHigginbottom, MHorwell, DCHughes, JLewthwaite, RAMcKnight, ATPinnock, RDPritchard, MCSuman-Chauhan, NWebb, CWilliams, SC PD 176252--the first high affinity non-peptide gastrin-releasing peptide (BB2) receptor antagonist. Bioorg Med Chem Lett8:2589-94 (1999) Neuromedin-B receptor
Name:Neuromedin-B receptor
Type:Enzyme Catalytic Domain
Mol. Mass.:43447.11
Organism:Homo sapiens (Human)
Description:Bombesin 1 NMBR 0::P28336
Residue:390
BDBM50071732
NameBDBM50071732
Synonyms:(S)-3-(1H-Indol-3-yl)-2-methyl-2-[3-(2-nitro-phenyl)-ureido]-N-(1-pyridin-2-yl-cyclohexylmethyl)-propionamide | CHEMBL89813
TypeSmall organic molecule
Emp. Form.C31H34N6O4
Mol. Mass.554.6395
SMILESC[C@@](Cc1c[nH]c2ccccc12)(NC(=O)Nc1ccccc1[N+]([O-])=O)C(=O)NCC1(CCCCC1)c1ccccn1