Reaction Details
TargetNeuromedin-B receptor
LigandBDBM50071748
Substrate/Competitorn/a
Meas. Tech.ChEBML_39622
Ki 0.390000±n/a nM
Citation Ashwood, VBrownhill, VHigginbottom, MHorwell, DCHughes, JLewthwaite, RAMcKnight, ATPinnock, RDPritchard, MCSuman-Chauhan, NWebb, CWilliams, SC PD 176252--the first high affinity non-peptide gastrin-releasing peptide (BB2) receptor antagonist. Bioorg Med Chem Lett8:2589-94 (1999) Neuromedin-B receptor
Name:Neuromedin-B receptor
Type:Enzyme Catalytic Domain
Mol. Mass.:43447.11
Organism:Homo sapiens (Human)
Description:Bombesin 1 NMBR 0::P28336
Residue:390
BDBM50071748
NameBDBM50071748
Synonyms:(S)-3-(1H-Indol-3-yl)-2-methyl-2-[3-(4-nitro-phenyl)-ureido]-N-(1-phenyl-cyclohexylmethyl)-propionamide | CHEMBL86370
TypeSmall organic molecule
Emp. Form.C32H35N5O4
Mol. Mass.553.6514
SMILESC[C@@](Cc1c[nH]c2ccccc12)(NC(=O)Nc1ccc(cc1)[N+]([O-])=O)C(=O)NCC1(CCCCC1)c1ccccc1