Reaction Details
TargetGastrin-releasing peptide receptor
LigandBDBM50071742
Substrate/Competitorn/a
Meas. Tech.ChEBML_39763
Ki 5.8±n/a nM
Citation Ashwood, VBrownhill, VHigginbottom, MHorwell, DCHughes, JLewthwaite, RAMcKnight, ATPinnock, RDPritchard, MCSuman-Chauhan, NWebb, CWilliams, SC PD 176252--the first high affinity non-peptide gastrin-releasing peptide (BB2) receptor antagonist. Bioorg Med Chem Lett8:2589-94 (1999) Gastrin-releasing peptide receptor
Name:Gastrin-releasing peptide receptor
Type:Enzyme Catalytic Domain
Mol. Mass.:43214.53
Organism:Homo sapiens (Human)
Description:Bombesin 2 GRPR 0::P30550
Residue:384
BDBM50071742
NameBDBM50071742
Synonyms:(S)-N-[1-(4-Ethoxy-phenyl)-cyclohexylmethyl]-3-(1H-indol-3-yl)-2-methyl-2-[3-(4-nitro-phenyl)-ureido]-propionamide | CHEMBL85291
TypeSmall organic molecule
Emp. Form.C34H39N5O5
Mol. Mass.597.704
SMILESCCOc1ccc(cc1)C1(CNC(=O)[C@](C)(Cc2c[nH]c3ccccc23)NC(=O)Nc2ccc(cc2)[N+]([O-])=O)CCCCC1