Reaction Details
TargetGastrin-releasing peptide receptor
LigandBDBM50071748
Substrate/Competitorn/a
Meas. Tech.ChEBML_39763
Ki 89±n/a nM
Citation Ashwood, VBrownhill, VHigginbottom, MHorwell, DCHughes, JLewthwaite, RAMcKnight, ATPinnock, RDPritchard, MCSuman-Chauhan, NWebb, CWilliams, SC PD 176252--the first high affinity non-peptide gastrin-releasing peptide (BB2) receptor antagonist. Bioorg Med Chem Lett8:2589-94 (1999) Gastrin-releasing peptide receptor
Name:Gastrin-releasing peptide receptor
Type:Enzyme Catalytic Domain
Mol. Mass.:43214.53
Organism:Homo sapiens (Human)
Description:Bombesin 2 GRPR 0::P30550
Residue:384
BDBM50071748
NameBDBM50071748
Synonyms:(S)-3-(1H-Indol-3-yl)-2-methyl-2-[3-(4-nitro-phenyl)-ureido]-N-(1-phenyl-cyclohexylmethyl)-propionamide | CHEMBL86370
TypeSmall organic molecule
Emp. Form.C32H35N5O4
Mol. Mass.553.6514
SMILESC[C@@](Cc1c[nH]c2ccccc12)(NC(=O)Nc1ccc(cc1)[N+]([O-])=O)C(=O)NCC1(CCCCC1)c1ccccc1