Reaction Details
TargetMu-type opioid receptor
LigandBDBM50071861
Substrate/Competitorn/a
Meas. Tech.ChEBML_221925
Ki 0.290000±n/a nM
Citation Mosberg, HIHo, JCSobczyk-Kojiro, K A high affinity, mu-opioid receptor-selective enkephalin analogue lacking an N-terminal tyrosine. Bioorg Med Chem Lett8:2681-4 (1999) Mu-type opioid receptor
Name:Mu-type opioid receptor
Type:Enzyme Catalytic Domain
Mol. Mass.:11165.58
Organism:GUINEA PIG
Description:P97266
Residue:98
BDBM50071861
NameBDBM50071861
Synonyms:12-[2-Amino-3-(4-hydroxy-phenyl)-propionylamino]-9-benzyl-5,5-dimethyl-8,11-dioxo-1,4-dithia-7,10-diaza-cyclotridecane-6-carboxylic acid amide | CHEMBL2370165
TypeSmall organic molecule
Emp. Form.C28H37N5O5S2
Mol. Mass.587.754
SMILESCC1(C)SCCSC[C@@H](NC(=O)[C@@H](N)Cc2ccc(O)cc2)C(=O)N[C@@H](Cc2ccccc2)C(=O)N[C@@H]1C(N)=O