Reaction Details
TargetDual specificity mitogen-activated protein kinase kinase 1/2
LigandBDBM50072145
Substrate/Competitorn/a
Meas. Tech.ChEMBL_28882 (CHEMBL645952)
IC50 26200±n/a nM
Citation Duncia, JVSantella, JBHigley, CAPitts, WJWityak, JFrietze, WERankin, FWSun, JHEarl, RATabaka, ACTeleha, CABlom, KFFavata, MFManos, EJDaulerio, AJStradley, DAHoriuchi, KCopeland, RAScherle, PATrzaskos, JMMagolda, RLTrainor, GLWexler, RRHobbs, FWOlson, RE MEK inhibitors: the chemistry and biological activity of U0126, its analogs, and cyclization products. Bioorg Med Chem Lett8:2839-44 (1999) Dual specificity mitogen-activated protein kinase kinase 1/2
Name:Dual specificity mitogen-activated protein kinase kinase 1/2
Type:n/a
Mol. Mass.:n/a
Description:ASSAY_ID of ChEMBL is 795758
Components:This complex has 2 components.
Component 1
Name:Dual specificity mitogen-activated protein kinase kinase 2
Synonyms:Dual specificity mitogen-activated protein kinase kinase 2 (MEK2) ERK activator kinase 2 MAP2K2 MAPKK 2 MKK2 PRKMK2 | VHL-MAP2K1/MAP2K2
Type:Enzyme Catalytic Domain
Mol. Mass.:44423.61
Organism:Homo sapiens (Human)
Description:gi_13489054
Residue:400
Component 2
Name:Dual specificity mitogen-activated protein kinase kinase 1
Synonyms:Dual specificity mitogen-activated protein kinase (MEK) Dual specificity mitogen-activated protein kinase kinase 1 (MEK1) Dual specificity mitogen-activated protein kinase kinase MEK1/2 MAP kinase kinase 1 MAPK/ERK kinase 1 MEK-1 MP2K1_HUMAN PRKMK1 | VHL-MAP2K1/MAP2K2
Type:Other Protein Type
Mol. Mass.:43439.03
Organism:Homo sapiens (Human)
Description:Full-length human MEK-1 was generated by PCR and purified as a fusion protein from Escherichia coli lysates.
Residue:393
BDBM50072145
NameBDBM50072145
Synonyms:2-Amino-5-(2-amino-phenylsulfanyl)-1H-pyrrole-3,4-dicarbonitrile | CHEMBL316536
TypeSmall organic molecule
Emp. Form.C12H9N5S
Mol. Mass.255.298
SMILESNc1[nH]c(Sc2ccccc2N)c(C#N)c1C#N