Reaction Details
TargetDual specificity mitogen-activated protein kinase kinase 1/2
LigandBDBM50072147
Substrate/Competitorn/a
Meas. Tech.ChEMBL_28879 (CHEMBL645949)
IC50 300±n/a nM
Citation Duncia, JVSantella, JBHigley, CAPitts, WJWityak, JFrietze, WERankin, FWSun, JHEarl, RATabaka, ACTeleha, CABlom, KFFavata, MFManos, EJDaulerio, AJStradley, DAHoriuchi, KCopeland, RAScherle, PATrzaskos, JMMagolda, RLTrainor, GLWexler, RRHobbs, FWOlson, RE MEK inhibitors: the chemistry and biological activity of U0126, its analogs, and cyclization products. Bioorg Med Chem Lett8:2839-44 (1999) Dual specificity mitogen-activated protein kinase kinase 1/2
Name:Dual specificity mitogen-activated protein kinase kinase 1/2
Type:n/a
Mol. Mass.:n/a
Description:ASSAY_ID of ChEMBL is 795758
Components:This complex has 2 components.
Component 1
Name:Dual specificity mitogen-activated protein kinase kinase 2
Synonyms:Dual specificity mitogen-activated protein kinase kinase 2 (MEK2) ERK activator kinase 2 MAP2K2 MAPKK 2 MKK2 PRKMK2 | VHL-MAP2K1/MAP2K2
Type:Enzyme Catalytic Domain
Mol. Mass.:44423.61
Organism:Homo sapiens (Human)
Description:gi_13489054
Residue:400
Component 2
Name:Dual specificity mitogen-activated protein kinase kinase 1
Synonyms:Dual specificity mitogen-activated protein kinase (MEK) Dual specificity mitogen-activated protein kinase kinase 1 (MEK1) Dual specificity mitogen-activated protein kinase kinase MEK1/2 MAP kinase kinase 1 MAPK/ERK kinase 1 MEK-1 MP2K1_HUMAN PRKMK1 | VHL-MAP2K1/MAP2K2
Type:Other Protein Type
Mol. Mass.:43439.03
Organism:Homo sapiens (Human)
Description:Full-length human MEK-1 was generated by PCR and purified as a fusion protein from Escherichia coli lysates.
Residue:393
BDBM50072147
NameBDBM50072147
Synonyms:(2Z,3Z)-2,3-bis(amino(2-aminophenylthio)methylene)succinonitrile 1,4-diamino-2,3-dicyano-1,4-bis[2-aminophenylthio]butadiene monoethanolate 2,3-Bis-[amino-(2-amino-phenylsulfanyl)-methylene]-succinonitrile 2-[1-Amino-1-(2-amino-phenylsulfanyl)-meth-(Z)-ylidene]-3-[1-amino-1-(2-amino-phenylsulfanyl)-meth-(E)-ylidene]-succinonitrile CHEMBL100473 U-0126
TypeSmall organic molecule
Emp. Form.C18H16N6S2
Mol. Mass.380.49
SMILESNc1ccccc1SC(=N)C(C#N)C(C#N)C(=N)Sc1ccccc1N