Reaction Details
TargetMuscarinic acetylcholine receptor M1/M2/M3/M4/M5
LigandBDBM50003365
Substrate/Competitorn/a
Meas. Tech.ChEMBL_222902 (CHEMBL845360)
IC50 5.7±n/a nM
Citation Sauerberg, PJeppesen, LOlesen, PHSheardown, MJFink-Jensen, ARasmussen, TRimvall, KShannon, HEBymaster, FPDeLapp, NWCalligaro, DOWard, JSWhitesitt, CAThomsen, C Identification of side chains on 1,2,5-thiadiazole-azacycles optimal for muscarinic m1 receptor activation. Bioorg Med Chem Lett8:2897-902 (1999) Muscarinic acetylcholine receptor M1/M2/M3/M4/M5
Name:Muscarinic acetylcholine receptor M1/M2/M3/M4/M5
Synonyms:Muscarinic acetylcholine receptor
Type:n/a
Mol. Mass.:n/a
Description:ASSAY_ID of ChEMBL is 1821274
Components:This complex has 5 components.
Component 1
Name:Muscarinic acetylcholine receptor M1
Type:Enzyme Catalytic Domain
Mol. Mass.:51390.46
Organism:RAT
Description:P08482
Residue:460
Component 2
Name:Muscarinic acetylcholine receptor M3
Synonyms:ACM3_RAT Chrm-3 | Chrm3
Type:Enzyme Catalytic Domain
Mol. Mass.:66086.66
Organism:RAT
Description:Cholinergic, muscarinic M3 CHRM3 RAT::P08483
Residue:589
Component 3
Name:Muscarinic acetylcholine receptor M4
Synonyms:ACM4_RAT Chrm-4 | Chrm4
Type:Enzyme Catalytic Domain
Mol. Mass.:52841.70
Organism:RAT
Description:Cholinergic, muscarinic M4 CHRM4 RAT::P08485
Residue:477
Component 4
Name:Muscarinic acetylcholine receptor M5
Synonyms:ACM5_RAT Chrm-5 Muscarinic acetylcholine receptor | Muscarinic acetylcholine receptor M5
Type:Enzyme Catalytic Domain
Mol. Mass.:60161.80
Organism:RAT
Description:Cholinergic, muscarinic M5 CHRM5 RAT::P08911
Residue:531
Component 5
Name:Muscarinic acetylcholine receptor M2
Synonyms:ACM2_RAT Chrm-2 | Chrm2
Type:Enzyme Catalytic Domain
Mol. Mass.:51555.53
Organism:RAT
Description:P10980
Residue:466
BDBM50003365
NameBDBM50003365
Synonyms:3-(3-(ethoxy)-1,2,5-thiadiazol-4-yl)-1,2,5,6-tetrahydro-1-methylpyridine 5-(4-Ethoxy-[1,2,5]thiadiazol-3-yl)-1-methyl-1,2,3,6-tetrahydro-pyridine; oxalic acid CHEMBL99476
TypeSmall organic molecule
Emp. Form.C10H15N3OS
Mol. Mass.225.311
SMILESCCOc1nsnc1C1=CCCN(C)C1