Reaction Details
TargetMuscarinic acetylcholine receptor M2
LigandBDBM50008072
Substrate/Competitorn/a
Meas. Tech.ChEBML_139656
EC50 63000±n/a nM
Citation Sauerberg, PJeppesen, LOlesen, PHSheardown, MJFink-Jensen, ARasmussen, TRimvall, KShannon, HEBymaster, FPDeLapp, NWCalligaro, DOWard, JSWhitesitt, CAThomsen, C Identification of side chains on 1,2,5-thiadiazole-azacycles optimal for muscarinic m1 receptor activation. Bioorg Med Chem Lett8:2897-902 (1999) Muscarinic acetylcholine receptor M2
Name:Muscarinic acetylcholine receptor M2
Type:GPCR
Mol. Mass.:51730.61
Organism:Homo sapiens (Human)
Description:P08172
Residue:466
BDBM50008072
NameBDBM50008072
Synonyms:(+)-pilocarpine (3S,4R)-3-ethyldihydro-4-((1-methyl-1H-imidazol-5-yl)methyl)-2(3H)-furanone CHEMBL550 PILOCARPINE | PILOCARPINE HYDROCHLORIDE
TypeSmall organic molecule
Emp. Form.C11H16N2O2
Mol. Mass.208.2569
SMILESCC[C@H]1[C@@H](Cc2cncn2C)COC1=O