Reaction Details
TargetProgesterone receptor
LigandBDBM50072714
Substrate/Competitorn/a
Meas. Tech.ChEMBL_159548 (CHEMBL765836)
Ki 0.950000±n/a nM
Citation Zhi, LTegley, CMEdwards, JPWest, SJMarschke, KBGottardis, MMMais, DEJones, TK 5-Alkyl 1,2-dihydrochromeno[3,4-f]quinolines: a novel class of nonsteroidal progesterone receptor modulators. Bioorg Med Chem Lett8:3365-70 (1999) Progesterone receptor
Name:Progesterone receptor
Type:Protein
Mol. Mass.:98979.52
Organism:Homo sapiens (Human)
Description:P06401
Residue:933
BDBM50072714
NameBDBM50072714
Synonyms:5-Butyl-2,2,4-trimethyl-2,5-dihydro-1H-6-oxa-1-aza-chrysene | CHEMBL325221
TypeSmall organic molecule
Emp. Form.C23H27NO
Mol. Mass.333.4666
SMILESCCCCC1Oc2ccccc2-c2ccc3NC(C)(C)C=C(C)c3c12